FailedConsole Output

Webhook: electronicboy pushed to PaperMC/Waterfall master at 1576018448. Previously at f708bf18d82385409e183a1ce2112d6b53c539c6 now at 34266257061f202518d238151859f3b9cbcaf2f7
Running as SYSTEM
Building in workspace /home/jenkins/jobs/Waterfall/workspace
No credentials specified
 > git rev-parse --is-inside-work-tree # timeout=10
Fetching changes from the remote Git repository
 > git config remote.origin.url https://github.com/PaperMC/Waterfall.git # timeout=10
Fetching upstream changes from https://github.com/PaperMC/Waterfall.git
 > git --version # timeout=10
 > git fetch --tags --progress -- https://github.com/PaperMC/Waterfall.git +refs/heads/*:refs/remotes/origin/* # timeout=10
 > git rev-parse refs/remotes/origin/master^{commit} # timeout=10
 > git rev-parse refs/remotes/origin/origin/master^{commit} # timeout=10
Checking out Revision 34266257061f202518d238151859f3b9cbcaf2f7 (refs/remotes/origin/master)
 > git config core.sparsecheckout # timeout=10
 > git checkout -f 34266257061f202518d238151859f3b9cbcaf2f7 # timeout=10
Commit message: "Updated Upstream (BungeeCord)"
 > git rev-list --no-walk f708bf18d82385409e183a1ce2112d6b53c539c6 # timeout=10
[workspace] $ /bin/sh -xe /tmp/jenkins9941186784865784170.sh
+ git submodule update --init
Submodule path 'BungeeCord': checked out '4cccf53775fc88b008e102bfd6d0cdcc7a044ac0'
+ ./waterfall p
Rebuilding Forked projects.... 
Resetting Waterfall-Proxy to BungeeCord...
Your branch is ahead of 'origin/master' by 138 commits.
  (use "git push" to publish your local commits)
HEAD is now at 4cccf537 Minecraft 1.15 support
  Applying patches to Waterfall-Proxy...
Applying: POM Changes
Applying: Copy license files into jar
Applying: Rename references from BungeeCord to Waterfall
Applying: Add Waterfall configuration files
Applying: Disable Metrics
Applying: Fetch modules from the Waterfall CI
Applying: Get rid of the security manager.
Applying: Fixup ProtocolConstants
Applying: Presize the HTTP response buffer
Applying: Don't access a ByteBuf's underlying array
Applying: Optimize uuid conversions
Applying: Add support for FML with IP Forwarding enabled
Applying: Better unit tests for Chat API
Applying: Allow removing servers or changing addresses on reload
Applying: Enable TCP_NODELAY.
Applying: Micro-optimizations
Applying: Allow invalid packet ids for forge servers
Applying: Resolve sendData() deadlocks
Applying: Add basic support for configurable tab-complete throttling
Applying: Improve server list ping logging
Applying: Add a property to accept invalid ping packets
Applying: Use a worker and a boss event loop group.
Applying: Better Decompression Sanity
Applying: Validate that chat messages are non-blank
Applying: Reduce the overhead of lots and lots of teams with the same names
Applying: Add dynamic server addition/removal api.
Applying: Add callEvent() shortcut to Event
Applying: Improve ServerKickEvent
Applying: Configurable server version in ping response
Applying: Add timeout variant to connect methods
Applying: Proxy query event
Applying: Dump the raw hex of a packet on a decoding error
Applying: Fix potion race condition on Forge 1.8.9
Applying: Optionally use async Netty DNS resolver
Applying: Improve outdated build message
Applying: Fix some forge plugin message packets not being forwarded correctly
Applying: Use Log4j2 for logging and TerminalConsoleAppender for console
Applying: Handle plugin prefixes using Log4J
Applying: Allow plugins to use SLF4J for logging
Applying: Add Log4j configuration that replicates the old BungeeCord setup
Applying: Add console command completion
Applying: Providing access to the player's LoginResult on LoginEvent
Applying: Optionally log InitialHandler connections
Applying: Forge is a first class citizen
Applying: Ignore empty packets
Applying: Don't use a bytebuf for packet decoding
Applying: Provide an option to disable entity metadata rewriting
Applying: Add ProxyDefineCommandsEvent
Applying: Use proper max length for serverbound chat packet
Applying: Report slow events in milliseconds
Applying: Fix upstream javadocs
Applying: OSX native zlib and crypto
Applying: Speed up packet construction
Applying: Cache session exceptions
  Patches applied cleanly to Waterfall-Proxy
+ cd Waterfall-Proxy
+ LD_LIBRARY_PATH=/usr/lib/openssl-1.0-compat
+ set MAVEN_OPTS=-Dstyle.color=enabled
Parsing POMs
Modules changed, recalculating dependency graph
Established TCP socket on 40529
[Waterfall-Proxy] $ /opt/adopt-jdk8u192-b12/bin/java -cp /home/jenkins/plugins/maven-plugin/WEB-INF/lib/maven35-agent-1.13.jar:/usr/share/maven/boot/plexus-classworlds-2.x.jar:/usr/share/maven/conf/logging jenkins.maven3.agent.Maven35Main /usr/share/maven /var/cache/jenkins/war/WEB-INF/lib/remoting-3.33.jar /home/jenkins/plugins/maven-plugin/WEB-INF/lib/maven35-interceptor-1.13.jar /home/jenkins/plugins/maven-plugin/WEB-INF/lib/maven3-interceptor-commons-1.13.jar 40529
<===[JENKINS REMOTING CAPACITY]===>channel started
Executing Maven:  -B -f /home/jenkins/jobs/Waterfall/workspace/Waterfall-Proxy/pom.xml clean install -Dbuild.number=302
[INFO] Scanning for projects...
[INFO] ------------------------------------------------------------------------
[INFO] Reactor Build Order:
[INFO] 
[INFO] Waterfall-Parent                                                   [pom]
[INFO] Waterfall-Chat                                                     [jar]
[INFO] Waterfall-Config                                                   [jar]
[INFO] Waterfall-Event                                                    [jar]
[INFO] Waterfall-Protocol                                                 [jar]
[INFO] Waterfall-API                                                      [jar]
[INFO] Waterfall-Native                                                   [jar]
[INFO] Waterfall-Query                                                    [jar]
[INFO] Waterfall-Proxy                                                    [jar]
[INFO] Waterfall-Bootstrap                                                [jar]
[INFO] Waterfall-Log                                                      [jar]
[INFO] Waterfall-Log                                                      [jar]
[INFO] Waterfall Modules                                                  [pom]
[INFO] cmd_alert                                                          [jar]
[INFO] cmd_find                                                           [jar]
[INFO] cmd_list                                                           [jar]
[INFO] cmd_send                                                           [jar]
[INFO] cmd_server                                                         [jar]
[INFO] reconnect_yaml                                                     [jar]
[INFO] 
[INFO] ---------------< io.github.waterfallmc:waterfall-parent >---------------
[INFO] Building Waterfall-Parent 1.15-SNAPSHOT                           [1/19]
[INFO] --------------------------------[ pom ]---------------------------------
[INFO] 
[INFO] --- maven-clean-plugin:2.5:clean (default-clean) @ waterfall-parent ---
[INFO] Deleting /home/jenkins/jobs/Waterfall/workspace/Waterfall-Proxy/target
[INFO] 
[INFO] --- scriptus:0.3.1:describe (default) @ waterfall-parent ---
[INFO] Set property "describe" to "git:Waterfall-Parent:1.15-SNAPSHOT:38e2e0c:302"
[INFO] 
[INFO] --- animal-sniffer-maven-plugin:1.18:check (default) @ waterfall-parent ---
[INFO] Checking unresolved references to org.codehaus.mojo.signature:java18:1.0
[INFO] 
[INFO] --- maven-install-plugin:2.4:install (default-install) @ waterfall-parent ---
[INFO] Installing /home/jenkins/jobs/Waterfall/workspace/Waterfall-Proxy/pom.xml to /home/jenkins/.m2/repository/io/github/waterfallmc/waterfall-parent/1.15-SNAPSHOT/waterfall-parent-1.15-SNAPSHOT.pom
[INFO] 
[INFO] ----------------< io.github.waterfallmc:waterfall-chat >----------------
[INFO] Building Waterfall-Chat 1.15-SNAPSHOT                             [2/19]
[INFO] --------------------------------[ jar ]---------------------------------
[INFO] 
[INFO] --- maven-clean-plugin:2.5:clean (default-clean) @ waterfall-chat ---
[INFO] Deleting /home/jenkins/jobs/Waterfall/workspace/Waterfall-Proxy/chat/target
[INFO] 
[INFO] --- scriptus:0.3.1:describe (default) @ waterfall-chat ---
[INFO] Set property "describe" to "git:Waterfall-Chat:1.15-SNAPSHOT:38e2e0c:302"
[INFO] 
[INFO] --- maven-resources-plugin:2.6:resources (default-resources) @ waterfall-chat ---
[INFO] Using 'UTF-8' encoding to copy filtered resources.
[INFO] Copying 2 resources
[INFO] 
[INFO] --- maven-compiler-plugin:3.1:compile (default-compile) @ waterfall-chat ---
[INFO] Changes detected - recompiling the module!
[INFO] Compiling 20 source files to /home/jenkins/jobs/Waterfall/workspace/Waterfall-Proxy/chat/target/classes
[INFO] 
[INFO] --- animal-sniffer-maven-plugin:1.18:check (default) @ waterfall-chat ---
[INFO] Checking unresolved references to org.codehaus.mojo.signature:java18:1.0
[INFO] 
[INFO] --- maven-resources-plugin:2.6:testResources (default-testResources) @ waterfall-chat ---
[INFO] Using 'UTF-8' encoding to copy filtered resources.
[INFO] skip non existing resourceDirectory /home/jenkins/jobs/Waterfall/workspace/Waterfall-Proxy/chat/src/test/resources
[INFO] 
[INFO] --- maven-compiler-plugin:3.1:testCompile (default-testCompile) @ waterfall-chat ---
[INFO] Changes detected - recompiling the module!
[INFO] Compiling 2 source files to /home/jenkins/jobs/Waterfall/workspace/Waterfall-Proxy/chat/target/test-classes
[INFO] 
[INFO] --- maven-surefire-plugin:2.12.4:test (default-test) @ waterfall-chat ---
[INFO] Surefire report directory: /home/jenkins/jobs/Waterfall/workspace/Waterfall-Proxy/chat/target/surefire-reports

-------------------------------------------------------
 T E S T S
-------------------------------------------------------
Running net.md_5.bungee.api.chat.TranslatableComponentTest
Tests run: 2, Failures: 0, Errors: 0, Skipped: 0, Time elapsed: 0.097 sec
Running net.md_5.bungee.api.chat.ComponentsTest
Tests run: 20, Failures: 0, Errors: 0, Skipped: 0, Time elapsed: 0.014 sec

Results :

Tests run: 22, Failures: 0, Errors: 0, Skipped: 0

[JENKINS] Recording test results
[INFO] 
[INFO] --- maven-jar-plugin:2.4:jar (default-jar) @ waterfall-chat ---
[INFO] Building jar: /home/jenkins/jobs/Waterfall/workspace/Waterfall-Proxy/chat/target/waterfall-chat-1.15-SNAPSHOT.jar
[INFO] 
[INFO] --- maven-install-plugin:2.4:install (default-install) @ waterfall-chat ---
[INFO] Installing /home/jenkins/jobs/Waterfall/workspace/Waterfall-Proxy/chat/target/waterfall-chat-1.15-SNAPSHOT.jar to /home/jenkins/.m2/repository/io/github/waterfallmc/waterfall-chat/1.15-SNAPSHOT/waterfall-chat-1.15-SNAPSHOT.jar
[INFO] Installing /home/jenkins/jobs/Waterfall/workspace/Waterfall-Proxy/chat/pom.xml to /home/jenkins/.m2/repository/io/github/waterfallmc/waterfall-chat/1.15-SNAPSHOT/waterfall-chat-1.15-SNAPSHOT.pom
[INFO] 
[INFO] ---------------< io.github.waterfallmc:waterfall-config >---------------
[INFO] Building Waterfall-Config 1.15-SNAPSHOT                           [3/19]
[INFO] --------------------------------[ jar ]---------------------------------
[INFO] 
[INFO] --- maven-clean-plugin:2.5:clean (default-clean) @ waterfall-config ---
[INFO] Deleting /home/jenkins/jobs/Waterfall/workspace/Waterfall-Proxy/config/target
[INFO] 
[INFO] --- scriptus:0.3.1:describe (default) @ waterfall-config ---
[INFO] Set property "describe" to "git:Waterfall-Config:1.15-SNAPSHOT:38e2e0c:302"
[INFO] 
[INFO] --- maven-resources-plugin:2.6:resources (default-resources) @ waterfall-config ---
[INFO] Using 'UTF-8' encoding to copy filtered resources.
[INFO] skip non existing resourceDirectory /home/jenkins/jobs/Waterfall/workspace/Waterfall-Proxy/config/src/main/resources
[INFO] 
[INFO] --- maven-compiler-plugin:3.1:compile (default-compile) @ waterfall-config ---
[INFO] Changes detected - recompiling the module!
[INFO] Compiling 3 source files to /home/jenkins/jobs/Waterfall/workspace/Waterfall-Proxy/config/target/classes
[INFO] 
[INFO] --- animal-sniffer-maven-plugin:1.18:check (default) @ waterfall-config ---
[INFO] Checking unresolved references to org.codehaus.mojo.signature:java18:1.0
[INFO] 
[INFO] --- maven-resources-plugin:2.6:testResources (default-testResources) @ waterfall-config ---
[INFO] Using 'UTF-8' encoding to copy filtered resources.
[INFO] skip non existing resourceDirectory /home/jenkins/jobs/Waterfall/workspace/Waterfall-Proxy/config/src/test/resources
[INFO] 
[INFO] --- maven-compiler-plugin:3.1:testCompile (default-testCompile) @ waterfall-config ---
[INFO] Changes detected - recompiling the module!
[INFO] Compiling 2 source files to /home/jenkins/jobs/Waterfall/workspace/Waterfall-Proxy/config/target/test-classes
[INFO] 
[INFO] --- maven-surefire-plugin:2.12.4:test (default-test) @ waterfall-config ---
[INFO] Surefire report directory: /home/jenkins/jobs/Waterfall/workspace/Waterfall-Proxy/config/target/surefire-reports

-------------------------------------------------------
 T E S T S
-------------------------------------------------------
Running net.md_5.bungee.config.YamlConfigurationTest
Tests run: 4, Failures: 0, Errors: 0, Skipped: 0, Time elapsed: 0.084 sec
Running net.md_5.bungee.config.DefaultConfigurationTest
Tests run: 1, Failures: 0, Errors: 0, Skipped: 0, Time elapsed: 0 sec

Results :

Tests run: 5, Failures: 0, Errors: 0, Skipped: 0

[JENKINS] Recording test results
[INFO] 
[INFO] --- maven-jar-plugin:2.4:jar (default-jar) @ waterfall-config ---
[INFO] Building jar: /home/jenkins/jobs/Waterfall/workspace/Waterfall-Proxy/config/target/waterfall-config-1.15-SNAPSHOT.jar
[INFO] 
[INFO] --- maven-install-plugin:2.4:install (default-install) @ waterfall-config ---
[INFO] Installing /home/jenkins/jobs/Waterfall/workspace/Waterfall-Proxy/config/target/waterfall-config-1.15-SNAPSHOT.jar to /home/jenkins/.m2/repository/io/github/waterfallmc/waterfall-config/1.15-SNAPSHOT/waterfall-config-1.15-SNAPSHOT.jar
[INFO] Installing /home/jenkins/jobs/Waterfall/workspace/Waterfall-Proxy/config/pom.xml to /home/jenkins/.m2/repository/io/github/waterfallmc/waterfall-config/1.15-SNAPSHOT/waterfall-config-1.15-SNAPSHOT.pom
[INFO] 
[INFO] ---------------< io.github.waterfallmc:waterfall-event >----------------
[INFO] Building Waterfall-Event 1.15-SNAPSHOT                            [4/19]
[INFO] --------------------------------[ jar ]---------------------------------
[INFO] 
[INFO] --- maven-clean-plugin:2.5:clean (default-clean) @ waterfall-event ---
[INFO] Deleting /home/jenkins/jobs/Waterfall/workspace/Waterfall-Proxy/event/target
[INFO] 
[INFO] --- scriptus:0.3.1:describe (default) @ waterfall-event ---
[INFO] Set property "describe" to "git:Waterfall-Event:1.15-SNAPSHOT:38e2e0c:302"
[INFO] 
[INFO] --- maven-resources-plugin:2.6:resources (default-resources) @ waterfall-event ---
[INFO] Using 'UTF-8' encoding to copy filtered resources.
[INFO] skip non existing resourceDirectory /home/jenkins/jobs/Waterfall/workspace/Waterfall-Proxy/event/src/main/resources
[INFO] 
[INFO] --- maven-compiler-plugin:3.1:compile (default-compile) @ waterfall-event ---
[INFO] Changes detected - recompiling the module!
[INFO] Compiling 4 source files to /home/jenkins/jobs/Waterfall/workspace/Waterfall-Proxy/event/target/classes
[INFO] 
[INFO] --- animal-sniffer-maven-plugin:1.18:check (default) @ waterfall-event ---
[INFO] Checking unresolved references to org.codehaus.mojo.signature:java18:1.0
[INFO] 
[INFO] --- maven-resources-plugin:2.6:testResources (default-testResources) @ waterfall-event ---
[INFO] Using 'UTF-8' encoding to copy filtered resources.
[INFO] skip non existing resourceDirectory /home/jenkins/jobs/Waterfall/workspace/Waterfall-Proxy/event/src/test/resources
[INFO] 
[INFO] --- maven-compiler-plugin:3.1:testCompile (default-testCompile) @ waterfall-event ---
[INFO] Changes detected - recompiling the module!
[INFO] Compiling 3 source files to /home/jenkins/jobs/Waterfall/workspace/Waterfall-Proxy/event/target/test-classes
[INFO] 
[INFO] --- maven-surefire-plugin:2.12.4:test (default-test) @ waterfall-event ---
[INFO] Surefire report directory: /home/jenkins/jobs/Waterfall/workspace/Waterfall-Proxy/event/target/surefire-reports

-------------------------------------------------------
 T E S T S
-------------------------------------------------------
Running net.md_5.bungee.event.UnregisteringListenerTest
Tests run: 1, Failures: 0, Errors: 0, Skipped: 0, Time elapsed: 0.026 sec
Running net.md_5.bungee.event.EventPriorityTest
Tests run: 1, Failures: 0, Errors: 0, Skipped: 0, Time elapsed: 0.001 sec
Running net.md_5.bungee.event.EventBusTest
Tests run: 1, Failures: 0, Errors: 0, Skipped: 0, Time elapsed: 0.001 sec

Results :

Tests run: 3, Failures: 0, Errors: 0, Skipped: 0

[JENKINS] Recording test results
[INFO] 
[INFO] --- maven-jar-plugin:2.4:jar (default-jar) @ waterfall-event ---
[INFO] Building jar: /home/jenkins/jobs/Waterfall/workspace/Waterfall-Proxy/event/target/waterfall-event-1.15-SNAPSHOT.jar
[INFO] 
[INFO] --- maven-install-plugin:2.4:install (default-install) @ waterfall-event ---
[INFO] Installing /home/jenkins/jobs/Waterfall/workspace/Waterfall-Proxy/event/target/waterfall-event-1.15-SNAPSHOT.jar to /home/jenkins/.m2/repository/io/github/waterfallmc/waterfall-event/1.15-SNAPSHOT/waterfall-event-1.15-SNAPSHOT.jar
[INFO] Installing /home/jenkins/jobs/Waterfall/workspace/Waterfall-Proxy/event/pom.xml to /home/jenkins/.m2/repository/io/github/waterfallmc/waterfall-event/1.15-SNAPSHOT/waterfall-event-1.15-SNAPSHOT.pom
[INFO] 
[INFO] --------------< io.github.waterfallmc:waterfall-protocol >--------------
[INFO] Building Waterfall-Protocol 1.15-SNAPSHOT                         [5/19]
[INFO] --------------------------------[ jar ]---------------------------------
[INFO] 
[INFO] --- maven-clean-plugin:2.5:clean (default-clean) @ waterfall-protocol ---
[INFO] Deleting /home/jenkins/jobs/Waterfall/workspace/Waterfall-Proxy/protocol/target
[INFO] 
[INFO] --- scriptus:0.3.1:describe (default) @ waterfall-protocol ---
[INFO] Set property "describe" to "git:Waterfall-Protocol:1.15-SNAPSHOT:38e2e0c:302"
[INFO] 
[INFO] --- maven-resources-plugin:2.6:resources (default-resources) @ waterfall-protocol ---
[INFO] Using 'UTF-8' encoding to copy filtered resources.
[INFO] skip non existing resourceDirectory /home/jenkins/jobs/Waterfall/workspace/Waterfall-Proxy/protocol/src/main/resources
[INFO] 
[INFO] --- maven-compiler-plugin:3.1:compile (default-compile) @ waterfall-protocol ---
[INFO] Changes detected - recompiling the module!
[INFO] Compiling 49 source files to /home/jenkins/jobs/Waterfall/workspace/Waterfall-Proxy/protocol/target/classes
[WARNING] /home/jenkins/jobs/Waterfall/workspace/Waterfall-Proxy/protocol/src/main/java/net/md_5/bungee/protocol/packet/Commands.java: Some input files use unchecked or unsafe operations.
[WARNING] /home/jenkins/jobs/Waterfall/workspace/Waterfall-Proxy/protocol/src/main/java/net/md_5/bungee/protocol/packet/Commands.java: Recompile with -Xlint:unchecked for details.
[INFO] 
[INFO] --- animal-sniffer-maven-plugin:1.18:check (default) @ waterfall-protocol ---
[INFO] Checking unresolved references to org.codehaus.mojo.signature:java18:1.0
[INFO] 
[INFO] --- maven-resources-plugin:2.6:testResources (default-testResources) @ waterfall-protocol ---
[INFO] Using 'UTF-8' encoding to copy filtered resources.
[INFO] skip non existing resourceDirectory /home/jenkins/jobs/Waterfall/workspace/Waterfall-Proxy/protocol/src/test/resources
[INFO] 
[INFO] --- maven-compiler-plugin:3.1:testCompile (default-testCompile) @ waterfall-protocol ---
[INFO] Changes detected - recompiling the module!
[INFO] Compiling 1 source file to /home/jenkins/jobs/Waterfall/workspace/Waterfall-Proxy/protocol/target/test-classes
[INFO] 
[INFO] --- maven-surefire-plugin:2.12.4:test (default-test) @ waterfall-protocol ---
[INFO] Surefire report directory: /home/jenkins/jobs/Waterfall/workspace/Waterfall-Proxy/protocol/target/surefire-reports

-------------------------------------------------------
 T E S T S
-------------------------------------------------------
Running net.md_5.bungee.protocol.packet.PluginMessageTest
Tests run: 1, Failures: 0, Errors: 0, Skipped: 0, Time elapsed: 0.029 sec

Results :

Tests run: 1, Failures: 0, Errors: 0, Skipped: 0

[JENKINS] Recording test results
[INFO] 
[INFO] --- maven-jar-plugin:2.4:jar (default-jar) @ waterfall-protocol ---
[INFO] Building jar: /home/jenkins/jobs/Waterfall/workspace/Waterfall-Proxy/protocol/target/waterfall-protocol-1.15-SNAPSHOT.jar
[INFO] 
[INFO] --- maven-install-plugin:2.4:install (default-install) @ waterfall-protocol ---
[INFO] Installing /home/jenkins/jobs/Waterfall/workspace/Waterfall-Proxy/protocol/target/waterfall-protocol-1.15-SNAPSHOT.jar to /home/jenkins/.m2/repository/io/github/waterfallmc/waterfall-protocol/1.15-SNAPSHOT/waterfall-protocol-1.15-SNAPSHOT.jar
[INFO] Installing /home/jenkins/jobs/Waterfall/workspace/Waterfall-Proxy/protocol/pom.xml to /home/jenkins/.m2/repository/io/github/waterfallmc/waterfall-protocol/1.15-SNAPSHOT/waterfall-protocol-1.15-SNAPSHOT.pom
[INFO] 
[INFO] ----------------< io.github.waterfallmc:waterfall-api >-----------------
[INFO] Building Waterfall-API 1.15-SNAPSHOT                              [6/19]
[INFO] --------------------------------[ jar ]---------------------------------
[INFO] 
[INFO] --- maven-clean-plugin:2.5:clean (default-clean) @ waterfall-api ---
[INFO] Deleting /home/jenkins/jobs/Waterfall/workspace/Waterfall-Proxy/api/target
[INFO] 
[INFO] --- scriptus:0.3.1:describe (default) @ waterfall-api ---
[INFO] Set property "describe" to "git:Waterfall-API:1.15-SNAPSHOT:38e2e0c:302"
[INFO] 
[INFO] --- maven-resources-plugin:2.6:resources (default-resources) @ waterfall-api ---
[INFO] Using 'UTF-8' encoding to copy filtered resources.
[INFO] skip non existing resourceDirectory /home/jenkins/jobs/Waterfall/workspace/Waterfall-Proxy/api/src/main/resources
[INFO] 
[INFO] --- maven-compiler-plugin:3.1:compile (default-compile) @ waterfall-api ---
[INFO] Changes detected - recompiling the module!
[INFO] Compiling 69 source files to /home/jenkins/jobs/Waterfall/workspace/Waterfall-Proxy/api/target/classes
[WARNING] /home/jenkins/jobs/Waterfall/workspace/Waterfall-Proxy/api/src/main/java/net/md_5/bungee/api/ProxyServer.java: Some input files use or override a deprecated API.
[WARNING] /home/jenkins/jobs/Waterfall/workspace/Waterfall-Proxy/api/src/main/java/net/md_5/bungee/api/ProxyServer.java: Recompile with -Xlint:deprecation for details.
[WARNING] /home/jenkins/jobs/Waterfall/workspace/Waterfall-Proxy/api/src/main/java/net/md_5/bungee/util/CaseInsensitiveMap.java: Some input files use unchecked or unsafe operations.
[WARNING] /home/jenkins/jobs/Waterfall/workspace/Waterfall-Proxy/api/src/main/java/net/md_5/bungee/util/CaseInsensitiveMap.java: Recompile with -Xlint:unchecked for details.
[INFO] 
[INFO] --- animal-sniffer-maven-plugin:1.18:check (default) @ waterfall-api ---
[INFO] Checking unresolved references to org.codehaus.mojo.signature:java18:1.0
[INFO] 
[INFO] --- maven-resources-plugin:2.6:testResources (default-testResources) @ waterfall-api ---
[INFO] Using 'UTF-8' encoding to copy filtered resources.
[INFO] skip non existing resourceDirectory /home/jenkins/jobs/Waterfall/workspace/Waterfall-Proxy/api/src/test/resources
[INFO] 
[INFO] --- maven-compiler-plugin:3.1:testCompile (default-testCompile) @ waterfall-api ---
[INFO] Changes detected - recompiling the module!
[INFO] Compiling 4 source files to /home/jenkins/jobs/Waterfall/workspace/Waterfall-Proxy/api/target/test-classes
[INFO] 
[INFO] --- maven-surefire-plugin:2.12.4:test (default-test) @ waterfall-api ---
[INFO] Surefire report directory: /home/jenkins/jobs/Waterfall/workspace/Waterfall-Proxy/api/target/surefire-reports

-------------------------------------------------------
 T E S T S
-------------------------------------------------------
Running net.md_5.bungee.api.ServerConnectRequestTest
Tests run: 3, Failures: 0, Errors: 0, Skipped: 0, Time elapsed: 0.025 sec
Running net.md_5.bungee.util.UUIDTest
Tests run: 2, Failures: 0, Errors: 0, Skipped: 0, Time elapsed: 0.034 sec
Running net.md_5.bungee.util.CaseInsensitiveTest
Tests run: 2, Failures: 0, Errors: 0, Skipped: 0, Time elapsed: 0.005 sec
Running net.md_5.bungee.util.AddressParseTest
Tests run: 8, Failures: 0, Errors: 0, Skipped: 0, Time elapsed: 0.008 sec

Results :

Tests run: 15, Failures: 0, Errors: 0, Skipped: 0

[JENKINS] Recording test results
[INFO] 
[INFO] --- maven-jar-plugin:2.4:jar (default-jar) @ waterfall-api ---
[INFO] Building jar: /home/jenkins/jobs/Waterfall/workspace/Waterfall-Proxy/api/target/waterfall-api-1.15-SNAPSHOT.jar
[INFO] 
[INFO] --- maven-install-plugin:2.4:install (default-install) @ waterfall-api ---
[INFO] Installing /home/jenkins/jobs/Waterfall/workspace/Waterfall-Proxy/api/target/waterfall-api-1.15-SNAPSHOT.jar to /home/jenkins/.m2/repository/io/github/waterfallmc/waterfall-api/1.15-SNAPSHOT/waterfall-api-1.15-SNAPSHOT.jar
[INFO] Installing /home/jenkins/jobs/Waterfall/workspace/Waterfall-Proxy/api/pom.xml to /home/jenkins/.m2/repository/io/github/waterfallmc/waterfall-api/1.15-SNAPSHOT/waterfall-api-1.15-SNAPSHOT.pom
[INFO] 
[INFO] ---------------< io.github.waterfallmc:waterfall-native >---------------
[INFO] Building Waterfall-Native 1.15-SNAPSHOT                           [7/19]
[INFO] --------------------------------[ jar ]---------------------------------
[INFO] 
[INFO] --- maven-clean-plugin:2.5:clean (default-clean) @ waterfall-native ---
[INFO] Deleting /home/jenkins/jobs/Waterfall/workspace/Waterfall-Proxy/native/target
[INFO] 
[INFO] --- scriptus:0.3.1:describe (default) @ waterfall-native ---
[INFO] Set property "describe" to "git:Waterfall-Native:1.15-SNAPSHOT:38e2e0c:302"
[INFO] 
[INFO] --- maven-resources-plugin:2.6:resources (default-resources) @ waterfall-native ---
[INFO] Using 'UTF-8' encoding to copy filtered resources.
[INFO] Copying 4 resources
[INFO] 
[INFO] --- maven-compiler-plugin:3.1:compile (default-compile) @ waterfall-native ---
[INFO] Changes detected - recompiling the module!
[INFO] Compiling 10 source files to /home/jenkins/jobs/Waterfall/workspace/Waterfall-Proxy/native/target/classes
[INFO] 
[INFO] --- animal-sniffer-maven-plugin:1.18:check (default) @ waterfall-native ---
[INFO] Checking unresolved references to org.codehaus.mojo.signature:java18:1.0
[INFO] 
[INFO] --- maven-resources-plugin:2.6:testResources (default-testResources) @ waterfall-native ---
[INFO] Using 'UTF-8' encoding to copy filtered resources.
[INFO] skip non existing resourceDirectory /home/jenkins/jobs/Waterfall/workspace/Waterfall-Proxy/native/src/test/resources
[INFO] 
[INFO] --- maven-compiler-plugin:3.1:testCompile (default-testCompile) @ waterfall-native ---
[INFO] Changes detected - recompiling the module!
[INFO] Compiling 2 source files to /home/jenkins/jobs/Waterfall/workspace/Waterfall-Proxy/native/target/test-classes
[INFO] 
[INFO] --- maven-surefire-plugin:2.12.4:test (default-test) @ waterfall-native ---
[INFO] Surefire report directory: /home/jenkins/jobs/Waterfall/workspace/Waterfall-Proxy/native/target/surefire-reports

-------------------------------------------------------
 T E S T S
-------------------------------------------------------
Running net.md_5.bungee.NativeZlibTest
Testing: [email protected]
Took: 253ms
Testing: [email protected]
Took: 204ms
Tests run: 1, Failures: 0, Errors: 0, Skipped: 0, Time elapsed: 0.557 sec
Running net.md_5.bungee.NativeCipherTest
Testing Java cipher...
This cipher works correctly!
Benchmarking Java cipher...
Encryption Iteration: 4096, Elapsed: 388 ms
Decryption Iteration: 4096, Elapsed: 368 ms
Testing native cipher...
This cipher works correctly!
Benchmarking native cipher...
Encryption Iteration: 4096, Elapsed: 304 ms
Decryption Iteration: 4096, Elapsed: 258 ms
Tests run: 4, Failures: 0, Errors: 0, Skipped: 0, Time elapsed: 1.388 sec

Results :

Tests run: 5, Failures: 0, Errors: 0, Skipped: 0

[JENKINS] Recording test results
[INFO] 
[INFO] --- maven-jar-plugin:2.4:jar (default-jar) @ waterfall-native ---
[INFO] Building jar: /home/jenkins/jobs/Waterfall/workspace/Waterfall-Proxy/native/target/waterfall-native-1.15-SNAPSHOT.jar
[INFO] 
[INFO] --- maven-install-plugin:2.4:install (default-install) @ waterfall-native ---
[INFO] Installing /home/jenkins/jobs/Waterfall/workspace/Waterfall-Proxy/native/target/waterfall-native-1.15-SNAPSHOT.jar to /home/jenkins/.m2/repository/io/github/waterfallmc/waterfall-native/1.15-SNAPSHOT/waterfall-native-1.15-SNAPSHOT.jar
[INFO] Installing /home/jenkins/jobs/Waterfall/workspace/Waterfall-Proxy/native/pom.xml to /home/jenkins/.m2/repository/io/github/waterfallmc/waterfall-native/1.15-SNAPSHOT/waterfall-native-1.15-SNAPSHOT.pom
[INFO] 
[INFO] ---------------< io.github.waterfallmc:waterfall-query >----------------
[INFO] Building Waterfall-Query 1.15-SNAPSHOT                            [8/19]
[INFO] --------------------------------[ jar ]---------------------------------
[INFO] 
[INFO] --- maven-clean-plugin:2.5:clean (default-clean) @ waterfall-query ---
[INFO] Deleting /home/jenkins/jobs/Waterfall/workspace/Waterfall-Proxy/query/target
[INFO] 
[INFO] --- scriptus:0.3.1:describe (default) @ waterfall-query ---
[INFO] Set property "describe" to "git:Waterfall-Query:1.15-SNAPSHOT:38e2e0c:302"
[INFO] 
[INFO] --- maven-resources-plugin:2.6:resources (default-resources) @ waterfall-query ---
[INFO] Using 'UTF-8' encoding to copy filtered resources.
[INFO] skip non existing resourceDirectory /home/jenkins/jobs/Waterfall/workspace/Waterfall-Proxy/query/src/main/resources
[INFO] 
[INFO] --- maven-compiler-plugin:3.1:compile (default-compile) @ waterfall-query ---
[INFO] Changes detected - recompiling the module!
[INFO] Compiling 2 source files to /home/jenkins/jobs/Waterfall/workspace/Waterfall-Proxy/query/target/classes
[WARNING] /home/jenkins/jobs/Waterfall/workspace/Waterfall-Proxy/query/src/main/java/net/md_5/bungee/query/QueryHandler.java: /home/jenkins/jobs/Waterfall/workspace/Waterfall-Proxy/query/src/main/java/net/md_5/bungee/query/QueryHandler.java uses or overrides a deprecated API.
[WARNING] /home/jenkins/jobs/Waterfall/workspace/Waterfall-Proxy/query/src/main/java/net/md_5/bungee/query/QueryHandler.java: Recompile with -Xlint:deprecation for details.
[INFO] 
[INFO] --- animal-sniffer-maven-plugin:1.18:check (default) @ waterfall-query ---
[INFO] Checking unresolved references to org.codehaus.mojo.signature:java18:1.0
[INFO] 
[INFO] --- maven-resources-plugin:2.6:testResources (default-testResources) @ waterfall-query ---
[INFO] Using 'UTF-8' encoding to copy filtered resources.
[INFO] skip non existing resourceDirectory /home/jenkins/jobs/Waterfall/workspace/Waterfall-Proxy/query/src/test/resources
[INFO] 
[INFO] --- maven-compiler-plugin:3.1:testCompile (default-testCompile) @ waterfall-query ---
[INFO] No sources to compile
[INFO] 
[INFO] --- maven-surefire-plugin:2.12.4:test (default-test) @ waterfall-query ---
[INFO] No tests to run.
[JENKINS] Recording test results
[INFO] 
[INFO] --- maven-jar-plugin:2.4:jar (default-jar) @ waterfall-query ---
[INFO] Building jar: /home/jenkins/jobs/Waterfall/workspace/Waterfall-Proxy/query/target/waterfall-query-1.15-SNAPSHOT.jar
[INFO] 
[INFO] --- maven-install-plugin:2.4:install (default-install) @ waterfall-query ---
[INFO] Installing /home/jenkins/jobs/Waterfall/workspace/Waterfall-Proxy/query/target/waterfall-query-1.15-SNAPSHOT.jar to /home/jenkins/.m2/repository/io/github/waterfallmc/waterfall-query/1.15-SNAPSHOT/waterfall-query-1.15-SNAPSHOT.jar
[INFO] Installing /home/jenkins/jobs/Waterfall/workspace/Waterfall-Proxy/query/pom.xml to /home/jenkins/.m2/repository/io/github/waterfallmc/waterfall-query/1.15-SNAPSHOT/waterfall-query-1.15-SNAPSHOT.pom
[INFO] 
[INFO] ---------------< io.github.waterfallmc:waterfall-proxy >----------------
[INFO] Building Waterfall-Proxy 1.15-SNAPSHOT                            [9/19]
[INFO] --------------------------------[ jar ]---------------------------------
[WARNING] The POM for io.github.waterfallmc:waterfall-log4j:jar:1.15-SNAPSHOT is missing, no dependency information available
[INFO] ------------------------------------------------------------------------
[INFO] Reactor Summary:
[INFO] 
[INFO] Waterfall-Parent 1.15-SNAPSHOT ..................... SUCCESS [  1.320 s]
[INFO] Waterfall-Chat 1.15-SNAPSHOT ....................... SUCCESS [  5.084 s]
[INFO] Waterfall-Config 1.15-SNAPSHOT ..................... SUCCESS [  2.114 s]
[INFO] Waterfall-Event 1.15-SNAPSHOT ...................... SUCCESS [  1.926 s]
[INFO] Waterfall-Protocol 1.15-SNAPSHOT ................... SUCCESS [  2.627 s]
[INFO] Waterfall-API 1.15-SNAPSHOT ........................ SUCCESS [  2.742 s]
[INFO] Waterfall-Native 1.15-SNAPSHOT ..................... SUCCESS [  3.745 s]
[INFO] Waterfall-Query 1.15-SNAPSHOT ...................... SUCCESS [  1.498 s]
[INFO] Waterfall-Proxy 1.15-SNAPSHOT ...................... FAILURE [  0.067 s]
[INFO] Waterfall-Bootstrap 1.15-SNAPSHOT .................. SKIPPED
[INFO] Waterfall-Log 1.15-SNAPSHOT ........................ SKIPPED
[INFO] Waterfall-Log 1.14-SNAPSHOT ........................ SKIPPED
[INFO] Waterfall Modules 1.15-SNAPSHOT .................... SKIPPED
[INFO] cmd_alert 1.15-SNAPSHOT ............................ SKIPPED
[INFO] cmd_find 1.15-SNAPSHOT ............................. SKIPPED
[INFO] cmd_list 1.15-SNAPSHOT ............................. SKIPPED
[INFO] cmd_send 1.15-SNAPSHOT ............................. SKIPPED
[INFO] cmd_server 1.15-SNAPSHOT ........................... SKIPPED
[INFO] reconnect_yaml 1.15-SNAPSHOT ....................... SKIPPED
[INFO] ------------------------------------------------------------------------
[INFO] BUILD FAILURE
[INFO] ------------------------------------------------------------------------
[INFO] Total time:  32.741 s
[INFO] Finished at: 2019-12-10T23:54:58+01:00
[INFO] ------------------------------------------------------------------------
Waiting for Jenkins to finish collecting data
[ERROR] Failed to execute goal on project waterfall-proxy: Could not resolve dependencies for project io.github.waterfallmc:waterfall-proxy:jar:1.15-SNAPSHOT: Could not find artifact io.github.waterfallmc:waterfall-log4j:jar:1.15-SNAPSHOT -> [Help 1]
[ERROR] 
[JENKINS] Archiving /home/jenkins/jobs/Waterfall/workspace/Waterfall-Proxy/api/pom.xml to io.github.waterfallmc/waterfall-api/1.15-SNAPSHOT/waterfall-api-1.15-SNAPSHOT.pom
[JENKINS] Archiving /home/jenkins/jobs/Waterfall/workspace/Waterfall-Proxy/api/target/waterfall-api-1.15-SNAPSHOT.jar to io.github.waterfallmc/waterfall-api/1.15-SNAPSHOT/waterfall-api-1.15-SNAPSHOT.jar
[ERROR] To see the full stack trace of the errors, re-run Maven with the -e switch.
[ERROR] Re-run Maven using the -X switch to enable full debug logging.
[ERROR] 
[ERROR] For more information about the errors and possible solutions, please read the following articles:
[ERROR] [Help 1] http://cwiki.apache.org/confluence/display/MAVEN/DependencyResolutionException
[ERROR] 
[ERROR] After correcting the problems, you can resume the build with the command
[ERROR]   mvn <goals> -rf :waterfall-proxy
[JENKINS] Archiving /home/jenkins/jobs/Waterfall/workspace/Waterfall-Proxy/protocol/pom.xml to io.github.waterfallmc/waterfall-protocol/1.15-SNAPSHOT/waterfall-protocol-1.15-SNAPSHOT.pom
[JENKINS] Archiving /home/jenkins/jobs/Waterfall/workspace/Waterfall-Proxy/protocol/target/waterfall-protocol-1.15-SNAPSHOT.jar to io.github.waterfallmc/waterfall-protocol/1.15-SNAPSHOT/waterfall-protocol-1.15-SNAPSHOT.jar
[JENKINS] Archiving /home/jenkins/jobs/Waterfall/workspace/Waterfall-Proxy/log4j/pom.xml to io.github.waterfallmc/waterfall-log4j/1.14-SNAPSHOT/waterfall-log4j-1.14-SNAPSHOT.pom
[JENKINS] Archiving /home/jenkins/jobs/Waterfall/workspace/Waterfall-Proxy/module/cmd-find/pom.xml to io.github.waterfallmc/waterfall-module-cmd-find/1.15-SNAPSHOT/waterfall-module-cmd-find-1.15-SNAPSHOT.pom
[JENKINS] Archiving /home/jenkins/jobs/Waterfall/workspace/Waterfall-Proxy/event/pom.xml to io.github.waterfallmc/waterfall-event/1.15-SNAPSHOT/waterfall-event-1.15-SNAPSHOT.pom
[JENKINS] Archiving /home/jenkins/jobs/Waterfall/workspace/Waterfall-Proxy/event/target/waterfall-event-1.15-SNAPSHOT.jar to io.github.waterfallmc/waterfall-event/1.15-SNAPSHOT/waterfall-event-1.15-SNAPSHOT.jar
[JENKINS] Archiving /home/jenkins/jobs/Waterfall/workspace/Waterfall-Proxy/module/cmd-server/pom.xml to io.github.waterfallmc/waterfall-module-cmd-server/1.15-SNAPSHOT/waterfall-module-cmd-server-1.15-SNAPSHOT.pom
[JENKINS] Archiving /home/jenkins/jobs/Waterfall/workspace/Waterfall-Proxy/module/cmd-send/pom.xml to io.github.waterfallmc/waterfall-module-cmd-send/1.15-SNAPSHOT/waterfall-module-cmd-send-1.15-SNAPSHOT.pom
[JENKINS] Archiving /home/jenkins/jobs/Waterfall/workspace/Waterfall-Proxy/query/pom.xml to io.github.waterfallmc/waterfall-query/1.15-SNAPSHOT/waterfall-query-1.15-SNAPSHOT.pom
[JENKINS] Archiving /home/jenkins/jobs/Waterfall/workspace/Waterfall-Proxy/query/target/waterfall-query-1.15-SNAPSHOT.jar to io.github.waterfallmc/waterfall-query/1.15-SNAPSHOT/waterfall-query-1.15-SNAPSHOT.jar
[JENKINS] Archiving /home/jenkins/jobs/Waterfall/workspace/Waterfall-Proxy/chat/pom.xml to io.github.waterfallmc/waterfall-chat/1.15-SNAPSHOT/waterfall-chat-1.15-SNAPSHOT.pom
[JENKINS] Archiving /home/jenkins/jobs/Waterfall/workspace/Waterfall-Proxy/chat/target/waterfall-chat-1.15-SNAPSHOT.jar to io.github.waterfallmc/waterfall-chat/1.15-SNAPSHOT/waterfall-chat-1.15-SNAPSHOT.jar
[JENKINS] Archiving /home/jenkins/jobs/Waterfall/workspace/Waterfall-Proxy/module/cmd-alert/pom.xml to io.github.waterfallmc/waterfall-module-cmd-alert/1.15-SNAPSHOT/waterfall-module-cmd-alert-1.15-SNAPSHOT.pom
[JENKINS] Archiving /home/jenkins/jobs/Waterfall/workspace/Waterfall-Proxy/bootstrap/pom.xml to io.github.waterfallmc/waterfall-bootstrap/1.15-SNAPSHOT/waterfall-bootstrap-1.15-SNAPSHOT.pom
[JENKINS] Archiving /home/jenkins/jobs/Waterfall/workspace/Waterfall-Proxy/config/pom.xml to io.github.waterfallmc/waterfall-config/1.15-SNAPSHOT/waterfall-config-1.15-SNAPSHOT.pom
[JENKINS] Archiving /home/jenkins/jobs/Waterfall/workspace/Waterfall-Proxy/config/target/waterfall-config-1.15-SNAPSHOT.jar to io.github.waterfallmc/waterfall-config/1.15-SNAPSHOT/waterfall-config-1.15-SNAPSHOT.jar
[JENKINS] Archiving /home/jenkins/jobs/Waterfall/workspace/Waterfall-Proxy/module/pom.xml to io.github.waterfallmc/waterfall-module/1.15-SNAPSHOT/waterfall-module-1.15-SNAPSHOT.pom
[JENKINS] Archiving /home/jenkins/jobs/Waterfall/workspace/Waterfall-Proxy/proxy/pom.xml to io.github.waterfallmc/waterfall-proxy/1.15-SNAPSHOT/waterfall-proxy-1.15-SNAPSHOT.pom
[JENKINS] Archiving /home/jenkins/jobs/Waterfall/workspace/Waterfall-Proxy/pom.xml to io.github.waterfallmc/waterfall-parent/1.15-SNAPSHOT/waterfall-parent-1.15-SNAPSHOT.pom
[JENKINS] Archiving /home/jenkins/jobs/Waterfall/workspace/Waterfall-Proxy/module/reconnect-yaml/pom.xml to io.github.waterfallmc/waterfall-module-reconnect-yaml/1.15-SNAPSHOT/waterfall-module-reconnect-yaml-1.15-SNAPSHOT.pom
[JENKINS] Archiving /home/jenkins/jobs/Waterfall/workspace/Waterfall-Proxy/module/cmd-list/pom.xml to io.github.waterfallmc/waterfall-module-cmd-list/1.15-SNAPSHOT/waterfall-module-cmd-list-1.15-SNAPSHOT.pom
[JENKINS] Archiving /home/jenkins/jobs/Waterfall/workspace/Waterfall-Proxy/native/pom.xml to io.github.waterfallmc/waterfall-native/1.15-SNAPSHOT/waterfall-native-1.15-SNAPSHOT.pom
[JENKINS] Archiving /home/jenkins/jobs/Waterfall/workspace/Waterfall-Proxy/native/target/waterfall-native-1.15-SNAPSHOT.jar to io.github.waterfallmc/waterfall-native/1.15-SNAPSHOT/waterfall-native-1.15-SNAPSHOT.jar
[JENKINS] Archiving /home/jenkins/jobs/Waterfall/workspace/Waterfall-Proxy/log/pom.xml to io.github.waterfallmc/waterfall-log/1.15-SNAPSHOT/waterfall-log-1.15-SNAPSHOT.pom
channel stopped
Skipped archiving because build is not successful
IRC notifier plugin: Sending notification to: #waterfall
Finished: FAILURE